Target
Fibroblast growth factor receptor 4
Ligand
BDBM91648
Substrate
Meas. Tech.
Omnia Assay
IC50
<100±n/a nM
Citation
 D Agostino, LASjin, RTNiu, DMcDonald, JJZhu, ZLiu, HMazdiyasni, HPetter, RCSingh, JBarrague, MGross, AMunson, M Heteroaryl compounds and uses thereof US Patent  US10189794 Publication Date 1/29/2019 
Target
Name:
Fibroblast growth factor receptor 4
Synonyms:
CD_antigen: CD334 FGFR4 FGFR4 Fibroblast growth factor receptor JK2 TKF
Type:
Protein
Mol. Mass.:
87957.45
Organism:
Homo sapiens (Human)
Description:
P22455
Residue:
802
  
Inhibitor
Name:
BDBM91648
Synonyms:
US10189794, Compound I-54 US10774052, Compound I-54 | US9695132, I-54
Type:
Small organic molecule
Emp. Form.:
C31H37N7O4
Mol. Mass.:
571.67
SMILES:
CCN1CCC(CC1)c1ccc(Nc2ncc3CN(C(=O)N(C)c3n2)c2cc(OC)cc(OC)c2)c(NC(=O)C=C)c1
: