Target
Fibroblast growth factor receptor 4
Ligand
BDBM91870
Substrate
Meas. Tech.
Omnia Assay
IC50
300±n/a nM
Citation
 D Agostino, LASjin, RTNiu, DMcDonald, JJZhu, ZLiu, HMazdiyasni, HPetter, RCSingh, JBarrague, MGross, AMunson, M Heteroaryl compounds and uses thereof US Patent  US10189794 Publication Date 1/29/2019 
Target
Name:
Fibroblast growth factor receptor 4
Synonyms:
CD_antigen: CD334 FGFR4 FGFR4 Fibroblast growth factor receptor JK2 TKF
Type:
Protein
Mol. Mass.:
87957.45
Organism:
Homo sapiens (Human)
Description:
P22455
Residue:
802
  
Inhibitor
Name:
BDBM91870
Synonyms:
US10189794, Compound I-68 US10774052, Compound I-68 | US9695132, I-68
Type:
Small organic molecule
Emp. Form.:
C26H30Cl2N6O4
Mol. Mass.:
561.46
SMILES:
COc1cc(OC)c(Cl)c(N2Cc3cnc(NC4CCCCC4NC(=O)C=C)nc3N(C3CC3)C2=O)c1Cl
: