Target
Fibroblast growth factor receptor 4
Ligand
BDBM99775
Substrate
Meas. Tech.
Omnia Assay
IC50
<100±n/a nM
Citation
 D Agostino, LASjin, RTNiu, DMcDonald, JJZhu, ZLiu, HMazdiyasni, HPetter, RCSingh, JBarrague, MGross, AMunson, M Heteroaryl compounds and uses thereof US Patent  US10189794 Publication Date 1/29/2019 
Target
Name:
Fibroblast growth factor receptor 4
Synonyms:
CD_antigen: CD334 FGFR4 FGFR4 Fibroblast growth factor receptor JK2 TKF
Type:
Protein
Mol. Mass.:
87957.45
Organism:
Homo sapiens (Human)
Description:
P22455
Residue:
802
  
Inhibitor
Name:
BDBM99775
Synonyms:
US10189794, Compound I-181 US10774052, Compound I-181 | US9695132, I-181
Type:
Small organic molecule
Emp. Form.:
C25H24Cl2N6O4
Mol. Mass.:
543.402
SMILES:
COc1cc(OC)c(Cl)c(N2Cc3cnc(Nc4ccccc4CNC(=O)C=C)nc3N(C)C2=O)c1Cl
: