Target
Fibroblast growth factor receptor 4
Ligand
BDBM100466
Substrate
Meas. Tech.
Omnia Assay
IC50
>1000±n/a nM
Citation
 D Agostino, LASjin, RTNiu, DMcDonald, JJZhu, ZLiu, HMazdiyasni, HPetter, RCSingh, JBarrague, MGross, AMunson, M Heteroaryl compounds and uses thereof US Patent  US10189794 Publication Date 1/29/2019 
Target
Name:
Fibroblast growth factor receptor 4
Synonyms:
CD_antigen: CD334 FGFR4 FGFR4 Fibroblast growth factor receptor JK2 TKF
Type:
Protein
Mol. Mass.:
87957.45
Organism:
Homo sapiens (Human)
Description:
P22455
Residue:
802
  
Inhibitor
Name:
BDBM100466
Synonyms:
US10189794, Compound I-222 US10774052, Compound I-222 | US9695132, I-222
Type:
Small organic molecule
Emp. Form.:
C23H28N6O3
Mol. Mass.:
436.5068
SMILES:
COc1ccc(cc1)N1Cc2cnc(N[C@@H]3CCCC[C@@H]3NC(=O)C=C)nc2N(C)C1=O
: