Target
4-aminobutyrate aminotransferase, mitochondrial
Ligand
BDBM323803
Substrate
Meas. Tech.
Biochemical assay
Ki
3300000±700000 nM
Citation
 Silverman, RBLe, HVHawker, DD Tetrahydrothiophene-based GABA aminotransferase inactivators US Patent  US10189807 Publication Date 1/29/2019 
Target
Name:
4-aminobutyrate aminotransferase, mitochondrial
Synonyms:
(S)-3-amino-2-methylpropionate transaminase ABAT GABA transaminase GABA-T GABT_HUMAN L-AIBAT
Type:
PROTEIN
Mol. Mass.:
56449.39
Organism:
Homo sapiens (Human)
Description:
ChEMBL_1459248
Residue:
500
  
Inhibitor
Name:
BDBM323803
Synonyms:
US10189807, Compound 21
Type:
Small organic molecule
Emp. Form.:
C5H9NO2S
Mol. Mass.:
147.195
SMILES:
[NH3+][C@H]1CS[C@@H](C1)C([O-])=O
: