Target
Guanylate cyclase soluble subunit alpha-1
Ligand
BDBM323824
Substrate
Meas. Tech.
HEK WC Assay
EC50
<20000±n/a nM
Citation
 Kim, CNakai, TLee, TWMoore, JPerl, NRRohde, JIyengar, RRMermerian, AFretzen, A SGC stimulators US Patent  US10189809 Publication Date 1/29/2019 
Target
Name:
Guanylate cyclase soluble subunit alpha-1
Synonyms:
GCS-alpha-1 GCYA1_HUMAN GUCSA3 GUCY1A3 Guanylate cyclase soluble subunit alpha-3 Solube guanylate cyclase alpha-1 (sGCalpha) | soluble guanylate cyclase alpha-1 (sGC)
Type:
Enzyme
Mol. Mass.:
77457.21
Organism:
Homo sapiens (Human)
Description:
Q02108
Residue:
690
  
Inhibitor
Name:
BDBM323824
Synonyms:
US10189809, Compound I-85
Type:
Small organic molecule
Emp. Form.:
C17H12FN5S
Mol. Mass.:
337.374
SMILES:
Fc1ccccc1Cn1nc(cc1-c1cscn1)-c1ncccn1
: