Target
Guanylate cyclase soluble subunit alpha-1
Ligand
BDBM323977
Substrate
Meas. Tech.
HEK WC Assay
EC50
<20000±n/a nM
Citation
 Kim, CNakai, TLee, TWMoore, JPerl, NRRohde, JIyengar, RRMermerian, AFretzen, A SGC stimulators US Patent  US10189809 Publication Date 1/29/2019 
Target
Name:
Guanylate cyclase soluble subunit alpha-1
Synonyms:
GCS-alpha-1 GCYA1_HUMAN GUCSA3 GUCY1A3 Guanylate cyclase soluble subunit alpha-3 Solube guanylate cyclase alpha-1 (sGCalpha) | soluble guanylate cyclase alpha-1 (sGC)
Type:
Enzyme
Mol. Mass.:
77457.21
Organism:
Homo sapiens (Human)
Description:
Q02108
Residue:
690
  
Inhibitor
Name:
BDBM323977
Synonyms:
US10189809, Compound I-161
Type:
Small organic molecule
Emp. Form.:
C17H11F2N5O2
Mol. Mass.:
355.2983
SMILES:
Oc1nc(ncc1F)-c1cc(-c2ccon2)n(Cc2ccccc2F)n1
: