Target
Guanylate cyclase soluble subunit alpha-1
Ligand
BDBM323994
Substrate
Meas. Tech.
HEK WC Assay
EC50
30000±n/a nM
Citation
 Kim, CNakai, TLee, TWMoore, JPerl, NRRohde, JIyengar, RRMermerian, AFretzen, A SGC stimulators US Patent  US10189809 Publication Date 1/29/2019 
Target
Name:
Guanylate cyclase soluble subunit alpha-1
Synonyms:
GCS-alpha-1 GCYA1_HUMAN GUCSA3 GUCY1A3 Guanylate cyclase soluble subunit alpha-3 Solube guanylate cyclase alpha-1 (sGCalpha) | soluble guanylate cyclase alpha-1 (sGC)
Type:
Enzyme
Mol. Mass.:
77457.21
Organism:
Homo sapiens (Human)
Description:
Q02108
Residue:
690
  
Inhibitor
Name:
BDBM323994
Synonyms:
US10189809, Compound I-281
Type:
Small organic molecule
Emp. Form.:
C18H12FN7O2
Mol. Mass.:
377.332
SMILES:
Fc1ccccc1Cn1nc(cc1-c1ccon1)-c1ncc2[nH]c(=O)[nH]c2n1
: