Target
Envelope glycoprotein gp160
Ligand
BDBM324032
Substrate
Meas. Tech.
Inhibition of HIV replication
EC50
<100±n/a nM
Citation
 Eastman, KJKadow, JFParcella, KENaidu, BNWang, TYin, ZZhang, Z Substituted pyridines as inhibitors of human immunodeficiency virus replication US Patent  US10189816 Publication Date 1/29/2019 
Target
Name:
Envelope glycoprotein gp160
Synonyms:
ENV_HV1S1 Glycoprotein 120 SU TM env gp41
Type:
PROTEIN
Mol. Mass.:
96162.42
Organism:
Human immunodeficiency virus type 1 group M subtype B (isolate SF162)(HIV-1)
Description:
ChEMBL_107610
Residue:
847
  
Inhibitor
Name:
BDBM324032
Synonyms:
US10189816, Compound 25
Type:
Small organic molecule
Emp. Form.:
C37H48FN3O3
Mol. Mass.:
601.7937
SMILES:
Cc1cc(F)ccc1CN1CCc2cc(ccc2C1)-c1c(C)nc(C)c([C@H](OC(C)(C)C)C(O)=O)c1N1CCC(C)(C)CC1
: