Target
Envelope glycoprotein gp160
Ligand
BDBM324046
Substrate
Meas. Tech.
Inhibition of HIV replication
EC50
<100±n/a nM
Citation
 Eastman, KJKadow, JFParcella, KENaidu, BNWang, TYin, ZZhang, Z Substituted pyridines as inhibitors of human immunodeficiency virus replication US Patent  US10189816 Publication Date 1/29/2019 
Target
Name:
Envelope glycoprotein gp160
Synonyms:
ENV_HV1S1 Glycoprotein 120 SU TM env gp41
Type:
PROTEIN
Mol. Mass.:
96162.42
Organism:
Human immunodeficiency virus type 1 group M subtype B (isolate SF162)(HIV-1)
Description:
ChEMBL_107610
Residue:
847
  
Inhibitor
Name:
BDBM324046
Synonyms:
US10189816, Compound 39
Type:
Small organic molecule
Emp. Form.:
C36H45ClFN3O3
Mol. Mass.:
622.212
SMILES:
Cc1nc(C)c(-c2ccc3CN(Cc4ccc(Cl)cc4F)CCc3c2)c(N2CCC(C)(C)CC2)c1[C@H](OC(C)(C)C)C(O)=O
: