Target
Coagulation factor IX
Ligand
BDBM324174
Substrate
Meas. Tech.
Determination of Inhibitory Activity Against Factor IXa
IC50
21.9±n/a nM
Citation
 Zhang, TChen, YGuo, LHruza, AJian, TLi, BMeng, DParker, DLSherer, ECWood, HBSakurada, I Factor IXa inhibitors US Patent  US10189819 Publication Date 1/29/2019 
Target
Name:
Coagulation factor IX
Synonyms:
Christmas factor Coagulation factor IX/VIII Coagulation factor IXa heavy chain F9 Factor IX Factor IXa (fIXa) Plasma thromboplastin component
Type:
Enzyme
Mol. Mass.:
51768.83
Organism:
Homo sapiens (Human)
Description:
P00740
Residue:
461
  
Inhibitor
Name:
BDBM324174
Synonyms:
US10189819, Example 3
Type:
Small organic molecule
Emp. Form.:
C28H27ClN6O2
Mol. Mass.:
515.006
SMILES:
Cc1cc2nc([nH]c2cc1C)C(CNC(=O)c1ccc(cc1Cl)-n1cc(CCO)nn1)c1ccccc1
: