Target
Serine/threonine-protein kinase B-raf [416-766,V600E]
Ligand
BDBM186822
Substrate
Meas. Tech.
Raf IC50 Assay
Temperature
298.15±n/a K
IC50
1900±n/a nM
Comments
extracted
Citation
 Zhou, CZhang, G Fused tricyclic urea compounds as Raf kinase and/or Raf kinase dimer inhibitors US Patent  US9670203 Publication Date 6/6/2017 
Target
Name:
Serine/threonine-protein kinase B-raf [416-766,V600E]
Synonyms:
B-Raf (V600E) BRAF1 RAFB1
Type:
Mol. Mass.:
39690.71
Organism:
Homo sapiens (Human)
Description:
PV3849, from Invitrogen
Residue:
351
  
Inhibitor
Name:
BDBM186822
Synonyms:
US9670203, Compound 1.14
Type:
Small organic molecule
Emp. Form.:
C26H20N4O4
Mol. Mass.:
452.4614
SMILES:
O=C(N[C@@H]1[C@H]2Oc3ccc(Oc4ccnc5NC(=O)CCc45)cc3[C@@H]12)Nc1cccc(c1)C#C
: