Target
Tyrosine-protein kinase BTK
Ligand
BDBM324288
Substrate
Meas. Tech.
BTK-POLYGAT-LS ASSAY
IC50
<1.000±n/a nM
Citation
 Hopkins, BTMa, BPrince, RMarx, ILyssikatos, JPZheng, FPeterson, MPatience, DB Inhibiting agents for Bruton's tyrosine kinase US Patent  US10189829 Publication Date 1/29/2019 
Target
Name:
Tyrosine-protein kinase BTK
Synonyms:
AGMX1 Agammaglobulinaemia tyrosine kinase B cell progenitor kinase BPK BTK_HUMAN Tyrosine Kinase BTK Tyrosine-protein kinase BTK (BTK)
Type:
Enzyme
Mol. Mass.:
76289.95
Organism:
Homo sapiens (Human)
Description:
Q06187
Residue:
659
  
Inhibitor
Name:
BDBM324288
Synonyms:
(R)-1-(tert-butyl)-N-(2-(2-methoxyethyl)-8-(2-((1-methyl-1H-pyrazol-4-yl)amino)pyrimidin-4-yl)-2,3,4,5-tetrahydro-1H-benzo[c]azepin-5-yl)-1H-1,2,3-triazole-4-carboxamide US10227341, Compound 31 US11858926, Compound 31
Type:
Small organic molecule
Emp. Form.:
C28H36N10O2
Mol. Mass.:
544.6512
SMILES:
COCCN1CC[C@@H](NC(=O)c2cn(nn2)C(C)(C)C)c2ccc(cc2C1)-c1ccnc(Nc2cnn(C)c2)n1
: