Target
Tyrosine-protein kinase BTK
Ligand
BDBM324317
Substrate
Meas. Tech.
BTK-POLYGAT-LS ASSAY
IC50
<1.000±n/a nM
Citation
 Hopkins, BTMa, BPrince, RMarx, ILyssikatos, JPZheng, FPeterson, MPatience, DB Inhibiting agents for Bruton's tyrosine kinase US Patent  US10189829 Publication Date 1/29/2019 
Target
Name:
Tyrosine-protein kinase BTK
Synonyms:
AGMX1 Agammaglobulinaemia tyrosine kinase B cell progenitor kinase BPK BTK_HUMAN Tyrosine Kinase BTK Tyrosine-protein kinase BTK (BTK)
Type:
Enzyme
Mol. Mass.:
76289.95
Organism:
Homo sapiens (Human)
Description:
Q06187
Residue:
659
  
Inhibitor
Name:
BDBM324317
Synonyms:
(R)-5-(tert-butyl)-N-(2- (3-hydroxycyclobutyl)-8- (2-((1-methyl-1H- pyrazol-4- yl)amino)pyrimidin-4- yl)-2,3,4,5-tetrahydro- 1H-benzo[c]azepin- 5-yl)- 1,3,4-oxadiazole-2- carboxamide US10227341, Compound 82 US11858926, Compound 82
Type:
Small organic molecule
Emp. Form.:
C29H35N9O3
Mol. Mass.:
557.6467
SMILES:
Cn1cc(Nc2nccc(n2)-c2ccc3[C@@H](CCN(Cc3c2)C2CC(O)C2)NC(=O)c2nnc(o2)C(C)(C)C)cn1
: