Target
Interstitial collagenase
Ligand
BDBM11549
Substrate
Fluorogenic Peptide Substrate
Meas. Tech.
MMP Inhibition Assay
pH
7.5±n/a
Temperature
298.15±n/a K
Ki
>4949±n/a nM
Citation
 Cherney, RJMo, RMeyer, DTHardman, KDLiu, RQCovington, MBQian, MWasserman, ZRChrist, DDTrzaskos, JMNewton, RCDecicco, CP Sultam hydroxamates as novel matrix metalloproteinase inhibitors. J Med Chem 47:2981-3 (2004)  
Target
Name:
Interstitial collagenase
Synonyms:
CLG MMP1 Matrix metalloproteinase-1 | Matrix metalloproteinase-1 (MMP-1)
Type:
Enzyme
Mol. Mass.:
54010.26
Organism:
Homo sapiens (Human)
Description:
P03956
Residue:
469
  
Inhibitor
Name:
BDBM11549
Synonyms:
2-[(3,5-dichloro-1,1-biphenyl-4-yl)methyl]-N-hydroxyisothiazolidine-3-carboxamide 1,1-dioxide Sultam Hydroxamate 15b
Type:
Small organic molecule
Emp. Form.:
C17H16Cl2N2O4S
Mol. Mass.:
415.291
SMILES:
ONC(=O)C1CCS(=O)(=O)N1Cc1ccc(cc1)-c1cc(Cl)cc(Cl)c1
:
Substrate
Name:
Fluorogenic Peptide Substrate
Synonyms:
Type:
Peptide
Mol. Mass.:
2468.31
Organism:
Description:
Residue:
23