Target
72 kDa type IV collagenase
Ligand
BDBM11552
Substrate
Fluorogenic Peptide Substrate
Meas. Tech.
MMP Inhibition Assay
Ki
<3.3±n/a nM
Citation
 Cherney, RJMo, RMeyer, DTHardman, KDLiu, RQCovington, MBQian, MWasserman, ZRChrist, DDTrzaskos, JMNewton, RCDecicco, CP Sultam hydroxamates as novel matrix metalloproteinase inhibitors. J Med Chem 47:2981-3 (2004)  
Target
Name:
72 kDa type IV collagenase
Synonyms:
72 kDa gelatinase CLG4A Gelatinase A (MMP-2) MMP2_HUMAN Matrix metalloproteinase-2 (MMP 2) Matrix metalloproteinases 2 (MMP-2) | TBE-1
Type:
Enzyme
Mol. Mass.:
73870.36
Organism:
Homo sapiens (Human)
Description:
P08253
Residue:
660
  
Inhibitor
Name:
BDBM11552
Synonyms:
(3R)-2-[(4-chloro-1,1-biphenyl-4-yl)methyl]-N-hydroxy-1,2-thiazinane-3-carboxamide 1,1-dioxide Sultam Hydroxamate 23b
Type:
Small organic molecule
Emp. Form.:
C18H19ClN2O4S
Mol. Mass.:
394.872
SMILES:
ONC(=O)[C@H]1CCCS(=O)(=O)N1Cc1ccc(cc1)-c1ccc(Cl)cc1
:
Substrate
Name:
Fluorogenic Peptide Substrate
Synonyms:
Type:
Peptide
Mol. Mass.:
2468.31
Organism:
Description:
Residue:
23