Target
72 kDa type IV collagenase
Ligand
BDBM11553
Substrate
Fluorogenic Peptide Substrate
Meas. Tech.
MMP Inhibition Assay
Ki
3.2±n/a nM
Citation
 Cherney, RJMo, RMeyer, DTHardman, KDLiu, RQCovington, MBQian, MWasserman, ZRChrist, DDTrzaskos, JMNewton, RCDecicco, CP Sultam hydroxamates as novel matrix metalloproteinase inhibitors. J Med Chem 47:2981-3 (2004)  
Target
Name:
72 kDa type IV collagenase
Synonyms:
72 kDa gelatinase CLG4A Gelatinase A (MMP-2) MMP2_HUMAN Matrix metalloproteinase-2 (MMP 2) Matrix metalloproteinases 2 (MMP-2) | TBE-1
Type:
Enzyme
Mol. Mass.:
73870.36
Organism:
Homo sapiens (Human)
Description:
P08253
Residue:
660
  
Inhibitor
Name:
BDBM11553
Synonyms:
(3R)-2-[(4-tert-butyl-1,1-biphenyl-4-yl)methyl]-N-hydroxy-1,2-thiazinane-3-carboxamide 1,1-dioxide Sultam Hydroxamate 23c
Type:
Small organic molecule
Emp. Form.:
C22H28N2O4S
Mol. Mass.:
416.534
SMILES:
CC(C)(C)c1ccc(cc1)-c1ccc(CN2[C@H](CCCS2(=O)=O)C(=O)NO)cc1
:
Substrate
Name:
Fluorogenic Peptide Substrate
Synonyms:
Type:
Peptide
Mol. Mass.:
2468.31
Organism:
Description:
Residue:
23