Target
Matrix metalloproteinase-9
Ligand
BDBM11551
Substrate
Fluorogenic Peptide Substrate
Meas. Tech.
MMP Inhibition Assay
Ki
0.9±n/a nM
Citation
 Cherney, RJMo, RMeyer, DTHardman, KDLiu, RQCovington, MBQian, MWasserman, ZRChrist, DDTrzaskos, JMNewton, RCDecicco, CP Sultam hydroxamates as novel matrix metalloproteinase inhibitors. J Med Chem 47:2981-3 (2004)  
Target
Name:
Matrix metalloproteinase-9
Synonyms:
67 kDa matrix metalloproteinase-9 92 kDa gelatinase CLG4B Gelatinase B MMP9 Matrix metalloproteinase 9 (MMP-9) Matrix metalloproteinase-9 (MMP9)
Type:
Enzyme
Mol. Mass.:
78452.28
Organism:
Homo sapiens (Human)
Description:
P14780
Residue:
707
  
Inhibitor
Name:
BDBM11551
Synonyms:
(3R)-N-hydroxy-2-[(4-methoxy-1,1-biphenyl-4-yl)methyl]-1,2-thiazinane-3-carboxamide 1,1-dioxide CHEMBL103418 | Sultam Hydroxamate 23a
Type:
Small organic molecule
Emp. Form.:
C19H22N2O5S
Mol. Mass.:
390.453
SMILES:
COc1ccc(cc1)-c1ccc(CN2[C@H](CCCS2(=O)=O)C(=O)NO)cc1
:
Substrate
Name:
Fluorogenic Peptide Substrate
Synonyms:
Type:
Peptide
Mol. Mass.:
2468.31
Organism:
Description:
Residue:
23