Target
Gag-Pol polyprotein
Ligand
BDBM267253
Substrate
Meas. Tech.
Determination of HIV-1 Reverse Transcriptase Inhibitory Activity
IC50
4.00±n/a nM
Citation
 Arrington, KLHan, YLi, YLuo, YPatel, M Non-nucleoside reverse transcriptase inhibitors US Patent  US10189831 Publication Date 1/29/2019 
Target
Name:
Gag-Pol polyprotein
Synonyms:
HIV-1 reverse transcriptase (HIV-1 RT) POL_HV1H2 Protease Reverse transcriptase (RT) gag-pol p66 RT
Type:
Protein
Mol. Mass.:
162074.74
Organism:
Human immunodeficiency virus type 1 group M subtype B (isolate HXB2)
Description:
P04585
Residue:
1435
  
Inhibitor
Name:
BDBM267253
Synonyms:
3-chloro-5-((1-((5-(4- (difluoromethoxy) phenyl)-6-oxo-1,6- dihydropyridazin-3- yl)methyl)-6-oxo-4- (trifluoromethyl)-1,6- dihydropyrimidin-5- yl)oxy)benzonitrile US9718819, 30
Type:
Small organic molecule
Emp. Form.:
C24H13ClF5N5O4
Mol. Mass.:
565.836
SMILES:
FC(F)Oc1ccc(cc1)-c1cc(Cn2cnc(c(Oc3cc(Cl)cc(c3)C#N)c2=O)C(F)(F)F)n[nH]c1=O
: