Target
Gag-Pol polyprotein
Ligand
BDBM267373
Substrate
Meas. Tech.
Determination of HIV-1 Reverse Transcriptase Inhibitory Activity
IC50
14.0±n/a nM
Citation
 Arrington, KLHan, YLi, YLuo, YPatel, M Non-nucleoside reverse transcriptase inhibitors US Patent  US10189831 Publication Date 1/29/2019 
Target
Name:
Gag-Pol polyprotein
Synonyms:
HIV-1 reverse transcriptase (HIV-1 RT) POL_HV1H2 Protease Reverse transcriptase (RT) gag-pol p66 RT
Type:
Protein
Mol. Mass.:
162074.74
Organism:
Human immunodeficiency virus type 1 group M subtype B (isolate HXB2)
Description:
P04585
Residue:
1435
  
Inhibitor
Name:
BDBM267373
Synonyms:
3-chloro-5-((6-oxo-1-((6- oxo-2-phenyl-1,6- dihydropyrimidin-5- yl)methyl)-4- (trifluoromethyl)-1,6- dihydropyrimidin-5- yl)oxy)benzonitrile US9718819, 149
Type:
Small organic molecule
Emp. Form.:
C23H13ClF3N5O3
Mol. Mass.:
499.829
SMILES:
FC(F)(F)c1ncn(Cc2cnc([nH]c2=O)-c2ccccc2)c(=O)c1Oc1cc(Cl)cc(c1)C#N
: