Target
Tyrosine-protein kinase JAK2
Ligand
BDBM324584
Substrate
Meas. Tech.
JAK Enzyme Assays
Ki
0.300±n/a nM
Citation
 Cheng, YHua, RKellar, TLi, WGibbons, PZak, ME Therapeutic compounds, compositions and methods of use thereof US Patent  US10189836 Publication Date 1/29/2019 
Target
Name:
Tyrosine-protein kinase JAK2
Synonyms:
JAK-2 JAK2_HUMAN Janus kinase 2 (JAK2) | Janus kinase 2 (a protein tyrosine kinase)
Type:
Protein
Mol. Mass.:
130684.68
Organism:
Homo sapiens (Human)
Description:
O60674
Residue:
1132
  
Inhibitor
Name:
BDBM324584
Synonyms:
2-[[3-[2-[[1-[2-(4- methylpiperazin-1-yl)-2- oxo-ethyl]pyrazol-4- yl]amino]- [1,2,4]triazolo[1,5-a] pyridin-8-yl]-3,8- diazabicyclo[3.2.1]octan- 8-yl]sulfonyl]benzonitrile | US10189836, Example 147
Type:
Small organic molecule
Emp. Form.:
C29H33N11O3S
Mol. Mass.:
615.709
SMILES:
CN1CCN(CC1)C(=O)Cn1cc(Nc2nc3c(cccn3n2)N2CC3CCC(C2)N3S(=O)(=O)c2ccccc2C#N)cn1
: