Target
Protein M2-1
Ligand
BDBM324700
Substrate
Meas. Tech.
Viral Cytopathic Effect (CPE) Assay
EC50
74.0±n/a nM
Citation
 Wang, LGao, LHuang, MGuo, LLiang, CZhu, WFeng, SZheng, XZhang, WWu, GWang, BYun, H Aza-oxo-indoles for the treatment and prophylaxis of respiratory syncytial virus infection US Patent  US10189838 Publication Date 1/29/2019 
Target
Name:
Protein M2-1
Synonyms:
Envelope-associated 22 kDa protein M21_HRSVA | Matrix M2-1
Type:
Enzyme Catalytic Domain
Mol. Mass.:
22163.59
Organism:
Human respiratory syncytial virus A (strain A2)
Description:
P04545
Residue:
194
  
Inhibitor
Name:
BDBM324700
Synonyms:
1'-({5-Chloro-1-[4-(S- methylsulfonimidoyl)butyl]-1H- pyrrolo[2,3-b]pyridin-2- yl}methyl)spiro[cyclopropane-1,3'- pyrrolo[2,3-c]pyridin]-2'(1'H)-one | US10189838, Example 14-3
Type:
Small organic molecule
Emp. Form.:
C22H24ClN5O2S
Mol. Mass.:
457.976
SMILES:
CS(=N)(=O)CCCCn1c(CN2C(=O)C3(CC3)c3ccncc23)cc2cc(Cl)cnc12
: