Target
Protein M2-1
Ligand
BDBM324704
Substrate
Meas. Tech.
Viral Cytopathic Effect (CPE) Assay
EC50
300±n/a nM
Citation
 Wang, LGao, LHuang, MGuo, LLiang, CZhu, WFeng, SZheng, XZhang, WWu, GWang, BYun, H Aza-oxo-indoles for the treatment and prophylaxis of respiratory syncytial virus infection US Patent  US10189838 Publication Date 1/29/2019 
Target
Name:
Protein M2-1
Synonyms:
Envelope-associated 22 kDa protein M21_HRSVA | Matrix M2-1
Type:
Enzyme Catalytic Domain
Mol. Mass.:
22163.59
Organism:
Human respiratory syncytial virus A (strain A2)
Description:
P04545
Residue:
194
  
Inhibitor
Name:
BDBM324704
Synonyms:
3-{5-Chloro-7-fluoro-2-[(2'- oxospiro[cyclopropane-1,3'- pyrrolo[2,3-c]pyridin]-1'(2'H)- yl)methyl]-1H-indol-1-yl}propanoic acid | US10189838, Example 16-2
Type:
Small organic molecule
Emp. Form.:
C21H17ClFN3O3
Mol. Mass.:
413.829
SMILES:
OC(=O)CCn1c(CN2C(=O)C3(CC3)c3ccncc23)cc2cc(Cl)cc(F)c12
: