Target
Carbonic anhydrase 4
Ligand
BDBM11613
Substrate
BDBM10856
Meas. Tech.
CA Inhibition Assay
Ki
280±n/a nM
Citation
 Ilies, MAVullo, DPastorek, JScozzafava, AIlies, MCaproiu, MTPastorekova, SSupuran, CT Carbonic anhydrase inhibitors. Inhibition of tumor-associated isozyme IX by halogenosulfanilamide and halogenophenylaminobenzolamide derivatives. J Med Chem 46:2187-96 (2003)  
Target
Name:
Carbonic anhydrase 4
Synonyms:
CA-IV CAH4_BOVIN Carbonic Anhydrase IV Carbonic anhydrase 4
Type:
Enzyme
Mol. Mass.:
35152.74
Organism:
Bos taurus (bovine)
Description:
Bovine isozyme, isolated from lung microsomes
Residue:
312
  
Inhibitor
Name:
BDBM11613
Synonyms:
4-Amino-3,5-diiodobenzenesulfonamide halogenosulfanilamide deriv. 14
Type:
Small organic molecule
Emp. Form.:
C6H6I2N2O2S
Mol. Mass.:
423.998
SMILES:
Nc1c(I)cc(cc1I)S(N)(=O)=O
:
Substrate
Name:
BDBM10856
Synonyms:
Carbon Dioxide | methanedione
Type:
Small organic molecule
Emp. Form.:
CO2
Mol. Mass.:
44.0095
SMILES:
O=C=O
: