Target
Carbonic anhydrase 9
Ligand
BDBM11609
Substrate
BDBM10856
Meas. Tech.
CA Inhibition Assay
Ki
33±n/a nM
Citation
 Ilies, MAVullo, DPastorek, JScozzafava, AIlies, MCaproiu, MTPastorekova, SSupuran, CT Carbonic anhydrase inhibitors. Inhibition of tumor-associated isozyme IX by halogenosulfanilamide and halogenophenylaminobenzolamide derivatives. J Med Chem 46:2187-96 (2003)  
Target
Name:
Carbonic anhydrase 9
Synonyms:
CA-IX CAH9_HUMAN Carbonic anhydrase 9 (CA IX) Carbonic anhydrase 9 precursor Carbonic anhydrase IX (CAIX) Carbonic anhydrases; II & IX MN RCC-associated antigen G250
Type:
Enzyme
Mol. Mass.:
49669.03
Organism:
Homo sapiens (Human)
Description:
Catalytic domain of human cloned isozyme was used in the assay
Residue:
459
  
Inhibitor
Name:
BDBM11609
Synonyms:
β-CA inhibitor, 8 4-amino-3-bromo-5-chlorobenzene-1-sulfonamide | halogenosulfanilamide deriv. 10
Type:
Small organic molecule
Emp. Form.:
C6H6BrClN2O2S
Mol. Mass.:
285.546
SMILES:
Nc1c(Cl)cc(cc1Br)S(N)(=O)=O
:
Substrate
Name:
BDBM10856
Synonyms:
Carbon Dioxide | methanedione
Type:
Small organic molecule
Emp. Form.:
CO2
Mol. Mass.:
44.0095
SMILES:
O=C=O
: