Target
Ectonucleotide pyrophosphatase/phosphodiesterase family member 2
Ligand
BDBM192943
Substrate
Meas. Tech.
Human ENPP2 (hENPP2) Assay
pH
8.5±n/a
Temperature
298.15±n/a K
IC50
50±n/a nM
Comments
extracted
Citation
 Desroy, NHeckmann, BBrys, RCJoncour, AMPeixoto, CBock, XM Compounds and pharmaceutical compositions thereof for the treatment of inflammatory disorders US Patent  US9670204 Publication Date 6/6/2017 
Target
Name:
Ectonucleotide pyrophosphatase/phosphodiesterase family member 2
Synonyms:
ATX Autotaxin (ATX) ENPP2 Ectonucleotide Pyrophosphatase/Phosphodiesterase 2 (ENPP2) Extracellular lysophospholipase D PDNP2
Type:
Enzyme
Mol. Mass.:
99007.13
Organism:
Homo sapiens (Human)
Description:
Q13822
Residue:
863
  
Inhibitor
Name:
BDBM192943
Synonyms:
US10526329, Compound 139 | US9670204, 138 2-((2-ethyl-6-(4-(2-(3-hydroxyazetidin-1-yl)-2-oxoethyl)piperazin-1-yl)imidazo[1,2-a]pyridin-3-yl)(methyl)amino)-4-(4-fluorophenyl)thiazole-5-carbonitrile
Type:
Small organic molecule
Emp. Form.:
C29H31FN8O2S
Mol. Mass.:
574.672
SMILES:
CCc1nc2ccc(cn2c1N(C)c1nc(c(s1)C#N)-c1ccc(F)cc1)N1CCN(CC(=O)N2CC(O)C2)CC1
: