Target
Tumor necrosis factor
Ligand
BDBM324774
Substrate
Meas. Tech.
TNF induced HEK-Blue assay
IC50
<1000±n/a nM
Citation
 Xiao, HDhar, MTDuan, JJiang, BTebben, AJ Substituted tricyclic heterocyclic compounds US Patent  US10189840 Publication Date 1/29/2019 
Target
Name:
Tumor necrosis factor
Synonyms:
Cachectin TNF-a TNFA TNFSF2 Tumor necrosis factor (TNFa) Tumor necrosis factor ligand superfamily member 2 Tumor necrosis factor, soluble form | tumor necrosis factor alpha
Type:
Enzyme
Mol. Mass.:
25645.11
Organism:
Homo sapiens (Human)
Description:
P01375
Residue:
233
  
Inhibitor
Name:
BDBM324774
Synonyms:
US10189840, Example 20
Type:
Small organic molecule
Emp. Form.:
C24H24FN5O
Mol. Mass.:
417.4787
SMILES:
Cc1ccc(C)c(c1)C1CC(F)c2nc3ccc(nc3n12)-c1cnc(nc1)C(C)(C)O
: