Target
Ubiquitin carboxyl-terminal hydrolase 1
Ligand
BDBM324938
Substrate
Meas. Tech.
Ubitquin-Rhodamine 110 Assay for USP1 Activity
IC50
<0.002±n/a nM
Citation
 Buckmelter, AJIoannidis, SFollows, BGustafson, GWang, MCaravella, JAWang, ZFritzen, ELLin, J Purinones as ubiquitin-specific protease 1 inhibitors US Patent  US10189841 Publication Date 1/29/2019 
Target
Name:
Ubiquitin carboxyl-terminal hydrolase 1
Synonyms:
Deubiquitinating enzyme 1 USP1 Ubiquitin thioesterase 1 hUBP
Type:
PROTEIN
Mol. Mass.:
88191.62
Organism:
Homo sapiens (Human)
Description:
ChEMBL_104169
Residue:
785
  
Inhibitor
Name:
BDBM324938
Synonyms:
2-(2-isopropylphenyl)-9-(1- US10399980, Compound I-144
Type:
Small organic molecule
Emp. Form.:
C24H26N6O
Mol. Mass.:
414.5028
SMILES:
CC(C)c1ccccc1-c1ncc2[nH]c(=O)n(C3CCN(CC3)c3cccnc3)c2n1
: