Target
Ubiquitin carboxyl-terminal hydrolase 1
Ligand
BDBM325243
Substrate
Meas. Tech.
Ubitquin-Rhodamine 110 Assay for USP1 Activity
IC50
<0.002±n/a nM
Citation
 Buckmelter, AJIoannidis, SFollows, BGustafson, GWang, MCaravella, JAWang, ZFritzen, ELLin, J Purinones as ubiquitin-specific protease 1 inhibitors US Patent  US10189841 Publication Date 1/29/2019 
Target
Name:
Ubiquitin carboxyl-terminal hydrolase 1
Synonyms:
Deubiquitinating enzyme 1 USP1 Ubiquitin thioesterase 1 hUBP
Type:
PROTEIN
Mol. Mass.:
88191.62
Organism:
Homo sapiens (Human)
Description:
ChEMBL_104169
Residue:
785
  
Inhibitor
Name:
BDBM325243
Synonyms:
2-(2-isopropylphenyl)-7- US10399980, Compound I-449 | US11161848, Compound I-449
Type:
Small organic molecule
Emp. Form.:
C26H30N6O3S
Mol. Mass.:
506.62
SMILES:
CC(C)c1ccccc1-c1ncc2n(C)c(=O)n(CC3CCN(CC3)S(=O)(=O)c3cccnc3)c2n1
: