Target
Tyrosine-protein kinase JAK2
Ligand
BDBM325385
Substrate
Meas. Tech.
JAK2 Inhibition Assay
IC50
<10±n/a nM
Citation
 Allen, SBoys, MLChicarelli, MJFell, JBFischer, JPGaudino, JHicken, EJHinklin, RJKraser, CFLaird, ERobinson, JETang, TPBurgess, LERieger, RAPheneger, JSatoh, YLeftheris, KRaheja, RKBennett, BL 4,6-substituted-pyrazolo[1,5-a]pyrazines as janus kinase inhibitors US Patent  US10189845 Publication Date 1/29/2019 
Target
Name:
Tyrosine-protein kinase JAK2
Synonyms:
JAK-2 JAK2_HUMAN Janus kinase 2 (JAK2) | Janus kinase 2 (a protein tyrosine kinase)
Type:
Protein
Mol. Mass.:
130684.68
Organism:
Homo sapiens (Human)
Description:
O60674
Residue:
1132
  
Inhibitor
Name:
BDBM325385
Synonyms:
3-(4-(6-(1-methyl-1H- pyrazol-4- yl)pyrazolo[1,5- a]pyrazin-4-yl)-1H- pyrazol-1-yl)pentan-1-ol US10730880, Example 47 | US11028093, Example 47
Type:
Small organic molecule
Emp. Form.:
C18H21N7O
Mol. Mass.:
351.4056
SMILES:
CCC(CCO)n1cc(cn1)-c1nc(cn2nccc12)-c1cnn(C)c1
: