Target
Muscarinic acetylcholine receptor M3
Ligand
BDBM325620
Substrate
Meas. Tech.
M3 Binding Assay
IC50
5.5±n/a nM
Citation
 Amari, GArmani, EBlackaby, WVan De Poeol, HBaker-Glenn, CTrivedi, N Aminoester derivatives US Patent  US9636336 Publication Date 5/2/2017 
Target
Name:
Muscarinic acetylcholine receptor M3
Synonyms:
ACM3_HUMAN Cholinergic, muscarinic M3 Muscarinic receptor M3 | RecName: Full=Muscarinic acetylcholine receptor M3
Type:
Enzyme
Mol. Mass.:
66151.03
Organism:
Homo sapiens (Human)
Description:
P20309
Residue:
590
  
Inhibitor
Name:
BDBM325620
Synonyms:
US9636336, Example 10 US9636336, Example 64 | [(1S)-2-(3,5-dichloro-1-oxido-pyridin-1-ium-4-yl)-1-(3,4-dimethoxyphenyl)ethyl]5-[[[2-oxo-1-phenyl-2-[[(3S)-quinuclidin-3-yl]methoxy]ethyl]amino]methyl]thiophene-2-carboxylate
Type:
Small organic molecule
Emp. Form.:
C37H39Cl2N3O7S
Mol. Mass.:
740.692
SMILES:
COc1ccc(cc1OC)[C@H](Cc1c(Cl)c[n+]([O-])cc1Cl)OC(=O)c1ccc(CNC(C(=O)OC[C@@H]2CN3CCC2CC3)c2ccccc2)s1
: