Target
Isoform PDE4B2 of cAMP-specific 3',5'-cyclic phosphodiesterase 4B (PDE4B2)
Ligand
BDBM325650
Substrate
Meas. Tech.
HTRF Assay
IC50
5.5±n/a nM
Citation
 Amari, GArmani, EBlackaby, WVan De Poeol, HBaker-Glenn, CTrivedi, N Aminoester derivatives US Patent  US9636336 Publication Date 5/2/2017 
Target
Name:
Isoform PDE4B2 of cAMP-specific 3',5'-cyclic phosphodiesterase 4B (PDE4B2)
Synonyms:
DPDE4 PDE4B2 cAMP-specific 3',5'-cyclic phosphodiesterase 4B (PDE4B2) | phosphodiesterase 4B2
Type:
Enzyme
Mol. Mass.:
64320.36
Organism:
Homo sapiens (Human)
Description:
Q07343-2
Residue:
564
  
Inhibitor
Name:
BDBM325650
Synonyms:
US9636336, Example 44 [(1S)-1-[3-(cyclopropylmethoxy)-4-(difluoromethoxy)phenyl]-2-(3,5-dichloro-1-oxido-pyridin-1-ium-4-yl)ethyl]5-[[[2-oxo-1-phenyl-2-(quinuclidin-4-ylmethoxy)ethyl]amino]methyl]thiophene-2-carboxylate
Type:
Small organic molecule
Emp. Form.:
C40H41Cl2F2N3O7S
Mol. Mass.:
816.737
SMILES:
[O-][n+]1cc(Cl)c(C[C@H](OC(=O)c2ccc(CNC(C(=O)OCC34CCN(CC3)CC4)c3ccccc3)s2)c2ccc(OC(F)F)c(OCC3CC3)c2)c(Cl)c1
: