Target
Muscarinic acetylcholine receptor M3
Ligand
BDBM325647
Substrate
Meas. Tech.
M3 Binding Assay
IC50
5.5±n/a nM
Citation
 Amari, GArmani, EBlackaby, WVan De Poeol, HBaker-Glenn, CTrivedi, N Aminoester derivatives US Patent  US9636336 Publication Date 5/2/2017 
Target
Name:
Muscarinic acetylcholine receptor M3
Synonyms:
ACM3_HUMAN Cholinergic, muscarinic M3 Muscarinic receptor M3 | RecName: Full=Muscarinic acetylcholine receptor M3
Type:
Enzyme
Mol. Mass.:
66151.03
Organism:
Homo sapiens (Human)
Description:
P20309
Residue:
590
  
Inhibitor
Name:
BDBM325647
Synonyms:
US9636336, Example 111 US9636336, Example 38 | [(1S)-2-(3,5-dichloro-1-oxido-pyridin-1-ium-4-yl)-1-(3,4-dimethoxyphenyl)ethyl]5-[[[1-[(1-methyl-4-piperidyl)methoxycarbonyl]indan-1-yl]amino]methyl]thiophene-2-carboxylate
Type:
Small organic molecule
Emp. Form.:
C38H41Cl2N3O7S
Mol. Mass.:
754.719
SMILES:
COc1ccc(cc1OC)[C@H](Cc1c(Cl)c[n+]([O-])cc1Cl)OC(=O)c1ccc(CNC2(CCc3ccccc23)C(=O)OCC2CCN(C)CC2)s1
: