Target
Metabotropic glutamate receptor 2
Ligand
BDBM212880
Substrate
Meas. Tech.
Biological Assay
IC50
7.00±n/a nM
Citation
 Bungard, CJConverso, ADe Leon, PHanney, BHartingh, TJManikowski, JJManley, PJMeissner, RMeng, ZPerkins, JJRudd, MTShu, Y Quinoline carboxamide and quinoline carbonitrile derivatives as mGluR2-negative allosteric modulators, compositions, and their use US Patent  US9636337 Publication Date 5/2/2017 
Target
Name:
Metabotropic glutamate receptor 2
Synonyms:
GPRC1B GRM2_HUMAN Metabotropic glutamate receptor mGlu2 | metabotropic glutamate 2
Type:
Enzyme
Mol. Mass.:
95584.88
Organism:
Homo sapiens (Human)
Description:
Q14416
Residue:
872
  
Inhibitor
Name:
BDBM212880
Synonyms:
US9278960, 2-27 | US9663506, Example 2-27
Type:
Small organic molecule
Emp. Form.:
C22H23N3O3
Mol. Mass.:
377.4363
SMILES:
CC1CCC(=CC1)c1cc(nc2cc(CN3C(=O)CCC3=O)ccc12)C(N)=O
: