Target
Metabotropic glutamate receptor 2
Ligand
BDBM212926
Substrate
Meas. Tech.
Biological Assay
IC50
19.0±n/a nM
Citation
 Bungard, CJConverso, ADe Leon, PHanney, BHartingh, TJManikowski, JJManley, PJMeissner, RMeng, ZPerkins, JJRudd, MTShu, Y Quinoline carboxamide and quinoline carbonitrile derivatives as mGluR2-negative allosteric modulators, compositions, and their use US Patent  US9636337 Publication Date 5/2/2017 
Target
Name:
Metabotropic glutamate receptor 2
Synonyms:
GPRC1B GRM2_HUMAN Metabotropic glutamate receptor mGlu2 | metabotropic glutamate 2
Type:
Enzyme
Mol. Mass.:
95584.88
Organism:
Homo sapiens (Human)
Description:
Q14416
Residue:
872
  
Inhibitor
Name:
BDBM212926
Synonyms:
US9278960, 3-45 | US9663506, Example 3-45
Type:
Small organic molecule
Emp. Form.:
C24H20F4N4O2
Mol. Mass.:
472.4348
SMILES:
CC[C@@](O)(c1cn(Cc2ccc3c(cc(nc3c2)C(N)=O)-c2ccc(F)cc2)cn1)C(F)(F)F
: