Target
Metabotropic glutamate receptor 2
Ligand
BDBM212929
Substrate
Meas. Tech.
Biological Assay
IC50
15.0±n/a nM
Citation
 Bungard, CJConverso, ADe Leon, PHanney, BHartingh, TJManikowski, JJManley, PJMeissner, RMeng, ZPerkins, JJRudd, MTShu, Y Quinoline carboxamide and quinoline carbonitrile derivatives as mGluR2-negative allosteric modulators, compositions, and their use US Patent  US9636337 Publication Date 5/2/2017 
Target
Name:
Metabotropic glutamate receptor 2
Synonyms:
GPRC1B GRM2_HUMAN Metabotropic glutamate receptor mGlu2 | metabotropic glutamate 2
Type:
Enzyme
Mol. Mass.:
95584.88
Organism:
Homo sapiens (Human)
Description:
Q14416
Residue:
872
  
Inhibitor
Name:
BDBM212929
Synonyms:
US9278960, 3-48 US9663506, Example 3-50
Type:
Small organic molecule
Emp. Form.:
C25H22F4N4O3
Mol. Mass.:
502.4608
SMILES:
CCC(O)(c1cn(Cc2ccc3c(cc(nc3c2)C(N)=O)-c2ccc(OC)cc2F)cn1)C(F)(F)F
: