Target
Metabotropic glutamate receptor 2
Ligand
BDBM213003
Substrate
Meas. Tech.
Biological Assay
IC50
14.0±n/a nM
Citation
 Bungard, CJConverso, ADe Leon, PHanney, BHartingh, TJManikowski, JJManley, PJMeissner, RMeng, ZPerkins, JJRudd, MTShu, Y Quinoline carboxamide and quinoline carbonitrile derivatives as mGluR2-negative allosteric modulators, compositions, and their use US Patent  US9636337 Publication Date 5/2/2017 
Target
Name:
Metabotropic glutamate receptor 2
Synonyms:
GPRC1B GRM2_HUMAN Metabotropic glutamate receptor mGlu2 | metabotropic glutamate 2
Type:
Enzyme
Mol. Mass.:
95584.88
Organism:
Homo sapiens (Human)
Description:
Q14416
Residue:
872
  
Inhibitor
Name:
BDBM213003
Synonyms:
US9278960, 4-87 US9663506, Example 4-88
Type:
Small organic molecule
Emp. Form.:
C22H20F4N4O
Mol. Mass.:
432.414
SMILES:
NC(=O)c1cc(-c2ccc(F)cc2)c2ccc(CN3CCNC(C3)C(F)(F)F)cc2n1
: