Target
Metabotropic glutamate receptor 2
Ligand
BDBM213079
Substrate
Meas. Tech.
Biological Assay
IC50
12.0±n/a nM
Citation
 Bungard, CJConverso, ADe Leon, PHanney, BHartingh, TJManikowski, JJManley, PJMeissner, RMeng, ZPerkins, JJRudd, MTShu, Y Quinoline carboxamide and quinoline carbonitrile derivatives as mGluR2-negative allosteric modulators, compositions, and their use US Patent  US9636337 Publication Date 5/2/2017 
Target
Name:
Metabotropic glutamate receptor 2
Synonyms:
GPRC1B GRM2_HUMAN Metabotropic glutamate receptor mGlu2 | metabotropic glutamate 2
Type:
Enzyme
Mol. Mass.:
95584.88
Organism:
Homo sapiens (Human)
Description:
Q14416
Residue:
872
  
Inhibitor
Name:
BDBM213079
Synonyms:
US9278960, 6-26 | US9663506, Example 6-26
Type:
Small organic molecule
Emp. Form.:
C24H20F3N5O
Mol. Mass.:
451.4437
SMILES:
Cn1cc(cn1)-c1cc(nc2cc(Cc3cc(nc(c3)C(F)(F)F)C3CC3)ccc12)C(N)=O
: