Target
Metabotropic glutamate receptor 2
Ligand
BDBM213089
Substrate
Meas. Tech.
Biological Assay
IC50
169±n/a nM
Citation
 Bungard, CJConverso, ADe Leon, PHanney, BHartingh, TJManikowski, JJManley, PJMeissner, RMeng, ZPerkins, JJRudd, MTShu, Y Quinoline carboxamide and quinoline carbonitrile derivatives as mGluR2-negative allosteric modulators, compositions, and their use US Patent  US9636337 Publication Date 5/2/2017 
Target
Name:
Metabotropic glutamate receptor 2
Synonyms:
GPRC1B GRM2_HUMAN Metabotropic glutamate receptor mGlu2 | metabotropic glutamate 2
Type:
Enzyme
Mol. Mass.:
95584.88
Organism:
Homo sapiens (Human)
Description:
Q14416
Residue:
872
  
Inhibitor
Name:
BDBM213089
Synonyms:
US9278960, 7-27 | US9636337, 7-27
Type:
Small organic molecule
Emp. Form.:
C20H21F2N5O
Mol. Mass.:
385.4104
SMILES:
Cn1cc(cn1)-c1cc(nc2c(F)c(CN3CCC(F)CC3)ccc12)C(N)=O
: