Target
Metabotropic glutamate receptor 2
Ligand
BDBM213090
Substrate
Meas. Tech.
Biological Assay
IC50
10.00±n/a nM
Citation
 Bungard, CJConverso, ADe Leon, PHanney, BHartingh, TJManikowski, JJManley, PJMeissner, RMeng, ZPerkins, JJRudd, MTShu, Y Quinoline carboxamide and quinoline carbonitrile derivatives as mGluR2-negative allosteric modulators, compositions, and their use US Patent  US9636337 Publication Date 5/2/2017 
Target
Name:
Metabotropic glutamate receptor 2
Synonyms:
GPRC1B GRM2_HUMAN Metabotropic glutamate receptor mGlu2 | metabotropic glutamate 2
Type:
Enzyme
Mol. Mass.:
95584.88
Organism:
Homo sapiens (Human)
Description:
Q14416
Residue:
872
  
Inhibitor
Name:
BDBM213090
Synonyms:
US9278960, 7-28 | US9636337, 7-28
Type:
Small organic molecule
Emp. Form.:
C25H21F5N4O3
Mol. Mass.:
520.4513
SMILES:
CCC(O)(c1cn(Cc2ccc3c(cc(nc3c2F)C(N)=O)-c2ccc(OC)c(F)c2)cn1)C(F)(F)F
: