Target
Metabotropic glutamate receptor 2
Ligand
BDBM213137
Substrate
Meas. Tech.
Biological Assay
IC50
8.00±n/a nM
Citation
 Bungard, CJConverso, ADe Leon, PHanney, BHartingh, TJManikowski, JJManley, PJMeissner, RMeng, ZPerkins, JJRudd, MTShu, Y Quinoline carboxamide and quinoline carbonitrile derivatives as mGluR2-negative allosteric modulators, compositions, and their use US Patent  US9636337 Publication Date 5/2/2017 
Target
Name:
Metabotropic glutamate receptor 2
Synonyms:
GPRC1B GRM2_HUMAN Metabotropic glutamate receptor mGlu2 | metabotropic glutamate 2
Type:
Enzyme
Mol. Mass.:
95584.88
Organism:
Homo sapiens (Human)
Description:
Q14416
Residue:
872
  
Inhibitor
Name:
BDBM213137
Synonyms:
US9278960, 8-44 US9636337, 8-45
Type:
Small organic molecule
Emp. Form.:
C25H22FN3O2
Mol. Mass.:
415.4595
SMILES:
COc1ccc(c(F)c1)-c1cc(nc2cc(ccc12)C(C)Cc1cccnc1)C(N)=O
: