Target
Metabotropic glutamate receptor 2
Ligand
BDBM213141
Substrate
Meas. Tech.
Biological Assay
IC50
10.00±n/a nM
Citation
 Bungard, CJConverso, ADe Leon, PHanney, BHartingh, TJManikowski, JJManley, PJMeissner, RMeng, ZPerkins, JJRudd, MTShu, Y Quinoline carboxamide and quinoline carbonitrile derivatives as mGluR2-negative allosteric modulators, compositions, and their use US Patent  US9636337 Publication Date 5/2/2017 
Target
Name:
Metabotropic glutamate receptor 2
Synonyms:
GPRC1B GRM2_HUMAN Metabotropic glutamate receptor mGlu2 | metabotropic glutamate 2
Type:
Enzyme
Mol. Mass.:
95584.88
Organism:
Homo sapiens (Human)
Description:
Q14416
Residue:
872
  
Inhibitor
Name:
BDBM213141
Synonyms:
US9278960, 8-48 US9636337, 8-49
Type:
Small organic molecule
Emp. Form.:
C26H23F2N3O2
Mol. Mass.:
447.4765
SMILES:
COc1ccc(c(F)c1)-c1cc(nc2cc(ccc12)C(C)Cc1ccc(CF)nc1)C(N)=O
: