Target
Cytochrome P450 11B1, mitochondrial
Ligand
BDBM325728
Substrate
Meas. Tech.
Enzymatic Activity Assay
EC50
2341±n/a nM
Citation
 Aebi, JAmrein, KBritton, RHornsperger, BKuhn, BMaerki, HPMartin, REMayweg, AVTan, X Phenyl-dihydropyridine derivatives as inhibitors of aldosterone synthase US Patent  US9636338 Publication Date 5/2/2017 
Target
Name:
Cytochrome P450 11B1, mitochondrial
Synonyms:
C11B1_HUMAN CYPXIB1 Cytochrome P450 11B1 Cytochrome P450 11B1, mitochondrial | S11BH
Type:
Enzyme
Mol. Mass.:
57591.44
Organism:
Homo sapiens (Human)
Description:
P15538
Residue:
503
  
Inhibitor
Name:
BDBM325728
Synonyms:
(rac)-4-(3-Fluoro-4-(trifluoromethyl)phenyl)-6,7-dihydro-5H-cyclopenta[c]pyridin-5-ol | US9636338, 2
Type:
Small organic molecule
Emp. Form.:
C15H11F4NO
Mol. Mass.:
297.2476
SMILES:
OC1CCc2cncc(c12)-c1ccc(c(F)c1)C(F)(F)F
: