Target
Cytochrome P450 11B2, mitochondrial
Ligand
BDBM325740
Substrate
Meas. Tech.
Enzymatic Activity Assay
EC50
1531±n/a nM
Citation
 Aebi, JAmrein, KBritton, RHornsperger, BKuhn, BMaerki, HPMartin, REMayweg, AVTan, X Phenyl-dihydropyridine derivatives as inhibitors of aldosterone synthase US Patent  US9636338 Publication Date 5/2/2017 
Target
Name:
Cytochrome P450 11B2, mitochondrial
Synonyms:
Aldosterone Synthase (CYP11B2) Aldosterone-synthesizing enzyme CYP11B2 Cytochrome P450 11B2 Cytochrome P450 11B2, mitochondrial P-450C18 | Steroid 18-hydroxylase
Type:
Protein
Mol. Mass.:
57582.15
Organism:
Homo sapiens (Human)
Description:
P19099
Residue:
503
  
Inhibitor
Name:
BDBM325740
Synonyms:
(rac)-2-[4-[3-Fluoro-4-(trifluoromethyl)phenyl]-6,7-dihydro-5H-cyclopenta[c]pyridin-5-yl]-N-propyl-acetamide | US9636338, 14
Type:
Small organic molecule
Emp. Form.:
C20H20F4N2O
Mol. Mass.:
380.3792
SMILES:
CCCNC(=O)CC1CCc2cncc(c12)-c1ccc(c(F)c1)C(F)(F)F
: