Target
Cytochrome P450 11B1, mitochondrial
Ligand
BDBM325742
Substrate
Meas. Tech.
Enzymatic Activity Assay
EC50
3628±n/a nM
Citation
 Aebi, JAmrein, KBritton, RHornsperger, BKuhn, BMaerki, HPMartin, REMayweg, AVTan, X Phenyl-dihydropyridine derivatives as inhibitors of aldosterone synthase US Patent  US9636338 Publication Date 5/2/2017 
Target
Name:
Cytochrome P450 11B1, mitochondrial
Synonyms:
C11B1_HUMAN CYPXIB1 Cytochrome P450 11B1 Cytochrome P450 11B1, mitochondrial | S11BH
Type:
Enzyme
Mol. Mass.:
57591.44
Organism:
Homo sapiens (Human)
Description:
P15538
Residue:
503
  
Inhibitor
Name:
BDBM325742
Synonyms:
(rac)-2-[4-[3-Fluoro-4-(trifluoromethyl)phenyl]-6,7-dihydro-5H-cyclopenta[c]pyridin-5-yl]-1-morpholino-ethanone | US9636338, 16
Type:
Small organic molecule
Emp. Form.:
C21H20F4N2O2
Mol. Mass.:
408.3893
SMILES:
Fc1cc(ccc1C(F)(F)F)-c1cncc2CCC(CC(=O)N3CCOCC3)c12
: