Target
Cytochrome P450 11B1, mitochondrial
Ligand
BDBM325754
Substrate
Meas. Tech.
G402-Based Assay
EC50
112±n/a nM
Citation
 Aebi, JAmrein, KBritton, RHornsperger, BKuhn, BMaerki, HPMartin, REMayweg, AVTan, X Phenyl-dihydropyridine derivatives as aldosterone synthase inhibitors US Patent  US9636339 Publication Date 5/2/2017 
Target
Name:
Cytochrome P450 11B1, mitochondrial
Synonyms:
C11B1_HUMAN CYPXIB1 Cytochrome P450 11B1 Cytochrome P450 11B1, mitochondrial | S11BH
Type:
Enzyme
Mol. Mass.:
57591.44
Organism:
Homo sapiens (Human)
Description:
P15538
Residue:
503
  
Inhibitor
Name:
BDBM325754
Synonyms:
(rac)-2-[4-[3-Fluoro-4-(trifluoromethyl)phenyl]-6,7-dihydro-5H-cyclopenta[c]pyridin-7-yl]-N-propyl-acetamide | US9636339, 4
Type:
Small organic molecule
Emp. Form.:
C20H20F4N2O
Mol. Mass.:
380.3792
SMILES:
CCCNC(=O)CC1CCc2c1cncc2-c1ccc(c(F)c1)C(F)(F)F
: