Target
Cytochrome P450 11B1, mitochondrial
Ligand
BDBM325755
Substrate
Meas. Tech.
G402-Based Assay
EC50
217±n/a nM
Citation
 Aebi, JAmrein, KBritton, RHornsperger, BKuhn, BMaerki, HPMartin, REMayweg, AVTan, X Phenyl-dihydropyridine derivatives as aldosterone synthase inhibitors US Patent  US9636339 Publication Date 5/2/2017 
Target
Name:
Cytochrome P450 11B1, mitochondrial
Synonyms:
C11B1_HUMAN CYPXIB1 Cytochrome P450 11B1 Cytochrome P450 11B1, mitochondrial | S11BH
Type:
Enzyme
Mol. Mass.:
57591.44
Organism:
Homo sapiens (Human)
Description:
P15538
Residue:
503
  
Inhibitor
Name:
BDBM325755
Synonyms:
(rac)-N-Cyclopropyl-2-[4-[3-fluoro-4-(trifluoromethyl)phenyl]-6,7-dihydro-5H-cyclopenta[c]pyridin-7-yl]acetamide | US9636339, 5
Type:
Small organic molecule
Emp. Form.:
C20H18F4N2O
Mol. Mass.:
378.3633
SMILES:
Fc1cc(ccc1C(F)(F)F)-c1cncc2C(CC(=O)NC3CC3)CCc12
: