Target
Cytochrome P450 11B2, mitochondrial
Ligand
BDBM325761
Substrate
Meas. Tech.
G402-Based Assay
EC50
8.00±n/a nM
Citation
 Aebi, JAmrein, KBritton, RHornsperger, BKuhn, BMaerki, HPMartin, REMayweg, AVTan, X Phenyl-dihydropyridine derivatives as aldosterone synthase inhibitors US Patent  US9636339 Publication Date 5/2/2017 
Target
Name:
Cytochrome P450 11B2, mitochondrial
Synonyms:
Aldosterone Synthase (CYP11B2) Aldosterone-synthesizing enzyme CYP11B2 Cytochrome P450 11B2 Cytochrome P450 11B2, mitochondrial P-450C18 | Steroid 18-hydroxylase
Type:
Protein
Mol. Mass.:
57582.15
Organism:
Homo sapiens (Human)
Description:
P19099
Residue:
503
  
Inhibitor
Name:
BDBM325761
Synonyms:
(rac)-2-[4-[3-Fluoro-4-(trifluoromethyl)phenyl]-6,7-dihydro-5H-cyclopenta[c]pyridin-7-yl]-N-(1H-pyrazol-3-yl)acetamide | US9636339, 11
Type:
Small organic molecule
Emp. Form.:
C20H16F4N4O
Mol. Mass.:
404.3609
SMILES:
Fc1cc(ccc1C(F)(F)F)-c1cncc2C(CC(=O)Nc3cc[nH]n3)CCc12
: