Target
Mitogen-activated protein kinase 1 [8-360]
Ligand
BDBM193385
Substrate
Meas. Tech.
ERK-2 Enzymatic Assay
pH
7.3±n/a
IC50
0.50±n/a nM
Comments
extracted
Citation
 Blake, JFCook, AGaudino, JGunawardana, IWHicken, EJHunt, KWLyon, MMetcalf, ATMohr, PJMoreno, DANewhouse, BRen, LSchwarz, JChen, HGazzard, LSchmidt, JDo, S Serine/threonine kinase inhibitors US Patent  US9670208 Publication Date 6/6/2017 
Target
Name:
Mitogen-activated protein kinase 1 [8-360]
Synonyms:
ERK2 MAPK1 Mitogen Activated Kinase 1 Mitogen-activated protein kinase 1 (aa 8-360) PRKM2
Type:
Mol. Mass.:
40835.09
Organism:
Homo sapiens (Human)
Description:
P28482 aa 8-360
Residue:
353
  
Inhibitor
Name:
BDBM193385
Synonyms:
US9670208, Example 57
Type:
Small organic molecule
Emp. Form.:
C21H16Cl2N8
Mol. Mass.:
451.311
SMILES:
Cn1nccc1Nc1nccc(n1)-c1ccn2c(Cc3cccc(Cl)c3Cl)nnc2c1
: