Target
Mitogen-activated protein kinase 1 [8-360]
Ligand
BDBM193387
Substrate
Meas. Tech.
ERK-2 Enzymatic Assay
pH
7.3±n/a
IC50
3.20±n/a nM
Comments
extracted
Citation
 Blake, JFCook, AGaudino, JGunawardana, IWHicken, EJHunt, KWLyon, MMetcalf, ATMohr, PJMoreno, DANewhouse, BRen, LSchwarz, JChen, HGazzard, LSchmidt, JDo, S Serine/threonine kinase inhibitors US Patent  US9670208 Publication Date 6/6/2017 
Target
Name:
Mitogen-activated protein kinase 1 [8-360]
Synonyms:
ERK2 MAPK1 Mitogen Activated Kinase 1 Mitogen-activated protein kinase 1 (aa 8-360) PRKM2
Type:
Mol. Mass.:
40835.09
Organism:
Homo sapiens (Human)
Description:
P28482 aa 8-360
Residue:
353
  
Inhibitor
Name:
BDBM193387
Synonyms:
US9670208, Example 84
Type:
Small organic molecule
Emp. Form.:
C22H17F2N7
Mol. Mass.:
417.4141
SMILES:
Cn1nccc1Nc1cc(ccn1)-c1ccn2c(Cc3ccc(F)cc3F)nnc2c1
: